martintools.net

Home > Fatal Error > Vs2010 Sp1

Vs2010 Sp1

Contents

Thanks! –Roland Sarrazin Mar 25 '14 at 14:34 add a comment| Your Answer draft saved draft discarded Sign up or log in Sign up using Google Sign up using Facebook Share a link to this question via email, Google+, Twitter, or Facebook. share|improve this answer edited Feb 18 '14 at 8:00 mlt 786827 answered Aug 14 '13 at 11:26 afree100 12618 Also SP1 seems helpful to get ammintrin.h. –mlt Feb 18 Call Stack (most recent call first): CMakeLists.txt:11 (project) Configuring incomplete, errors occurred!

Furthermore, i already had Windows 7 SDK installed. edit flag offensive delete link more add a comment Login/Signup to Answer Question Tools Follow subscribe to rss feed Stats Asked: 2013-10-17 10:09:04 -0600 Seen: 2,673 times Last updated: Nov 14 All rights reserved. 1>------ Build started: Project: cmTryCompileExec4006816612, Configuration: Debug x64 ------ 1> Microsoft (R) C/C++ Optimizing Compiler Version 16.00.30319.01 for x64 1> Copyright (C) Microsoft Corporation. It fails with the following output: Change Dir: C:/OpenCV2.2/build/CMakeFiles/CMakeTmp Run Build Command:C:\Windows\Microsoft.NET\Framework\v4.0.30319\MSBuild.exe cmTryCompileExec2312584318.vcxproj /p:Configuration=Debug /p:VisualStudioVersion=10.0 Microsoft (R) Build Engine version 4.0.30319.17929 [Microsoft .NET Framework, version 4.0.30319.17929] Copyright (C) Microsoft Corporation. http://stackoverflow.com/questions/16837650/failed-to-configure-cmake-with-visual-studio-2010-express

Vs2010 Sp1

Pentest Results: Questionable CSRF Attack more hot questions question feed about us tour help blog chat data legal privacy policy work here advertising info mobile contact us feedback Technology Life / I uninstalled both and reinstalled 2010 and it works fine now. Some reasons please. Maclean___________________________________________ -- Powered by www.kitware.com Visit other Kitware open-source projects at http://www.kitware.com/opensource/opensource.htmlPlease keep messages on-topic and check the CMake FAQ at: http://www.cmake.org/Wiki/CMake_FAQFollow this link to subscribe/unsubscribe: http://www.cmake.org/mailman/listinfo/cmake Andrew Maclean-3 Reply |

Reply Johnk524 says: May 16, 2014 at 9:53 am Definitely, what a fantastic website and informative posts, I definitely will bookmark your blog.All the Best! If you remove Visual C++ the error will not disappear; Please let me know if it works property for you! says: November 10, 2015 at 8:09 am It works! I am success.Thanks for all and specially thank to admin.

Your Answer draft saved draft discarded Sign up or log in Sign up using Google Sign up using Facebook Sign up using Email and Password Post as a guest Name P. I started getting this error. http://stackoverflow.com/questions/21853396/cmake-opengl-build-error-link-fatal-error-lnk1123-failure-during-conversion All rights reserved. 1>------ Build started: Project: cmTryCompileExec2926210968, Configuration: Debug x64 ------ 1> Microsoft (R) C/C++ Optimizing Compiler Version 16.00.30319.01 for x64 1> Copyright (C) Microsoft Corporation.

Reply Got something to say? David -- Powered by www.kitware.com Visit other Kitware open-source projects at http://www.kitware.com/opensource/opensource.htmlPlease keep messages on-topic and check the CMake FAQ at: http://www.cmake.org/Wiki/CMake_FAQFollow this link to subscribe/unsubscribe: http://www.cmake.org/mailman/listinfo/cmake Andrew Maclean-3 Reply | Sent from an Android tablet. Why is onboard/inflight shopping still a thing?

The C Compiler Cl.exe Is Not Able To Compile A Simple Test Program

All rights reserved. 1> 1> cl /c /Zi /W3 /WX- /Od /Ob0 /D WIN32 /D _WINDOWS /D _DEBUG /D "CMAKE_INTDIR=\"Debug\"" /D _MBCS /Gm- /RTC1 /MDd /GS /fp:precise /Zc:wchar_t /Zc:forScope /Fo"cmTryCompileExec2926210968.dir\Debug\\" /Fd"C:/build/VTK/CMakeFiles/CMakeTmp/Debug/cmTryCompileExec2926210968.pdb" https://support.microsoft.com/en-us/kb/2757355 Which theme is this and how to get it on Ubuntu 16.04? Vs2010 Sp1 Join them; it only takes a minute: Sign up LINK : fatal error LNK1123: failure during conversion to COFF: file invalid or corrupt up vote 3 down vote favorite I am Reply zerelli says: January 6, 2014 at 1:54 pm It work fine!!

PrepareForBuild: Creating directory "cmTryCompileExec2312584318.dir\Debug\". Regards   Andrew---------- Forwarded message ---------- From: David Cole <[hidden email]>To: Michael Jackson <[hidden email]> Cc: "[hidden email] MailingList" <[hidden email]> Date: Wed, 28 Nov 2012 08:17:24 -0500Subject: Re: [CMake] Problem with Visual Studio 2010, Windows 7 My guess is that you will have to uninstall newer versions before upgrading the older ones to new service packs. What danger/code violation is oversized breakers?

Any suggestions? > > David > -- > > Powered by www.kitware.com > > Visit other Kitware open-source projects at http://www.kitware.com/opensource/opensource.html> > Please keep messages on-topic and check the CMake FAQ All rights reserved. thanks Reply Grettchen says: June 23, 2014 at 4:14 am Thank you very much! Name (required) Mail (will not be published) (required) Website Notify me of follow-up comments by email.

I've used Cmake for other projects with out issue but it wouldn't surprise me if I'm doing something bone headed with PCL. It is working Reply appleapps says: October 27, 2015 at 8:07 am Simply superb solution… It works Reply G.J. plzzzz Reply thuong says: September 8, 2013 at 7:31 pm I try to rename file cvtres.exe .

Just google them.

ClCompile: C:\Program Files (x86)\Microsoft Visual Studio 10.0\VC\bin\CL.exe /c /Zi /W3 /WX- /Od /Ob0 /Oy- /D WIN32 /D _WINDOWS /D _DEBUG /D "CMAKE_INTDIR=\"Debug\"" /D _MBCS /Gm- /RTC1 /MDd /GS /fp:precise /Zc:wchar_t /Zc:forScope I have no problems, the only thing I can think of is that I >> had VS 2010 SP1 installed before I installed VS 2012 Express, I did not use >> If you remove Visual C++ the error will not disappear; Please let me know if it works property for you! CMake file for CUDA files Problem compiling OpenCV 2.4.13 with Cmake and MinGW How to improve Vehicle Color Detection accuracy?

That's one reason why you have the vsvars-batch files to set up the environment. Generic Null/Empty check of each property of a class Kant's analytic/synthetic propositions How to map the displacement texture? Powered by WordPress. I also had VS 2012 installed, could that cause a problem?

VS 2010 SP1 update gived me errors before installing Windows 7 SDK so it is required. Build FAILED. "C:\Users\redfood\Documents\pcl1_7_rc1\build\CMakeFiles\CMakeTmp\cmTryCompileExec4116348285.vcxproj" (default target) (1) -> (Link target) -> LINK : fatal error LNK1123: failure during conversion to COFF: file invalid or corrupt Your solution helped me. How do I align a split environment to the left?

For future reference, what other information could I have provided? Share this:TwitterFacebookLike this:Like Loading... When you install Visual Studio Windows will dutifully add the Visual Studio tools to the PATH for everyone. The error was happened only after window update. 🙁 It is fixed after i replaced cvtres.exe.

current community chat Stack Overflow Meta Stack Overflow your communities Sign up or log in to customize your list. I renamed cvtres.exe to cvtres1.exe and the problem was solved…:) Reply tttt says: January 28, 2014 at 9:56 pm OTHER WAYS TO SOLVE IT: Go to C:\Program Files (x86)\Microsoft Visual Studio I have Visual Studio 2010 installed. I uninstalled both and reinstalled 2010 and it works fine now.

It was not VS Express, but just VS 2010. At least that has been > my experience on many machines. > > David > -- Here is my theory on mixing visual studios. Search for: Recent Posts error LNK2019: unresolved external symbol _main referenced in function ___tmainCRTStartup error LNK2019 File URIs inWindows [CMAKE] [Fixed] fatal error LNK1123: failure during conversion to COFF: file invalid http://social.msdn.microsoft.com/Forums/da-DK/vssetup/thread/d10adba0-e082-494a-bb16-2bfc039faa80 or http://stackoverflow.com/questions/10888391/link-fatal-error-lnk1123-failure-during-conversion-to-coff-file-invalid-or-c PetrOn Wed, Nov 28, 2012 at 4:12 AM, Andrew Maclean <[hidden email]> wrote: VS 2012 will not cause a problem I have both VS 2010 and VS2012  (both

Project Files may be invalid” ?)10CMake configuring fails. “cl.exe is not able to compile a simple test program”-1Error 'LINK : fatal error LNK1123: failure during conversion to COFF: file invalid or Now install Visual Studio 2012 (or any other version) alonside VS2010 and Windows will again the 2012 to the PATH also. VS 2010 on Windows 7 works great > for me, even for a VTK build tree... Of course I could be wrong on most of the above but it works for me for the last 3 years so I am not about to change.

Point Cloud Library (PCL) Users mailing list Search everywhere only in this topic Advanced Search CMake configuration error using Windows 7 Classic List Threaded ♦ ♦ Locked 2 messages redfood Reply For future reference, what other information could I have provided?

© Copyright 2017 martintools.net. All rights reserved.